BDBM324769 US10189840, Example 15
SMILES CC(C)(O)c1ccc(cc1)-c1ccc2nc3C(F)CC(c4ccccc4OC(F)F)n3c2n1
InChI Key InChIKey=FXWYBCDCDHAQFS-UHFFFAOYSA-N
Data  1 IC50
  Tab Delimited (TSV)   2D SDfile   Computed 3D by Vconf -m prep SDfile
Find this compound or compounds like it in BindingDB:
Activity Spreadsheet -- Enzyme Inhibition Constant Data from BindingDB
Found 1 hit for monomerid = 324769
TargetTumor necrosis factor(Homo sapiens (Human))
Bristol-Myers Squibb
US Patent
LigandPNGBDBM324769(US10189840, Example 15)
Affinity DataIC50: <1.00E+3nM. Assay description: Test compounds serially diluted in DMSO were plated in an assay plate (Labcyte, Cat. #LP-0200) at final concentrations ranging from 0.004 μM to ...
Ligand InfoPC cidPC sid
In DepthDetails US Patent