BDBM324775 US10189840, Example 21
SMILES CC(C)(O)c1ccc(cc1)-c1ccc2nc3C(F)CC(c4ccccc4C4CC4)n3c2n1
InChI Key InChIKey=DCQCGNMFCGZMGL-UHFFFAOYSA-N
Data  1 IC50
  Tab Delimited (TSV)   2D SDfile   Computed 3D by Vconf -m prep SDfile
Find this compound or compounds like it in BindingDB:
Activity Spreadsheet -- Enzyme Inhibition Constant Data from BindingDB
Found 1 hit for monomerid = 324775
TargetTumor necrosis factor(Homo sapiens (Human))
Bristol-Myers Squibb
US Patent
LigandPNGBDBM324775(US10189840, Example 21)
Affinity DataIC50: <1.00E+3nM. Assay description: Test compounds serially diluted in DMSO were plated in an assay plate (Labcyte, Cat. #LP-0200) at final concentrations ranging from 0.004 μM to ...
Ligand InfoPC cidPC sid
In DepthDetails US Patent