BDBM32478 piperazine amide, 6d
SMILES Clc1cccc(NC(=O)c2cscn2)c1N1CCN(CC=C)CC1
InChI Key InChIKey=HUGQVXKORQQUFW-UHFFFAOYSA-N
Data  1 IC50
  Tab Delimited (TSV)   2D SDfile   Computed 3D by Vconf -m prep SDfile
Find this compound or compounds like it in BindingDB:
Activity Spreadsheet -- Enzyme Inhibition Constant Data from BindingDB
Found 1 hit for monomerid = 32478
TargetIsoform Alpha-1 of Mitogen-activated protein kinase 10 (Alpha-1) 9-402](Homo sapiens (Human))
The Scripps Research Institute
LigandPNGBDBM32478(piperazine amide, 6d)
Affinity DataIC50:  2.30E+3nMpH: 7.0 T: 2°C. Assay description: Biochemical IC50s for JNK were determined using HTRF. In each assay the phosphor-Thr71-ATF-2 product was detected using a Europium-cryptate labeled a...
In DepthDetails ArticlePubMed