BDBM32491 aryl piperidine, 9g
SMILES Cc1ccc(o1)C(=O)Nc1cccc(C)c1N1CCC2(CC1)OCCO2
InChI Key InChIKey=BHMYLUVZDOIZTR-UHFFFAOYSA-N
Data  2 IC50
  Tab Delimited (TSV)   2D SDfile   Computed 3D by Vconf -m prep SDfile
Find this compound or compounds like it in BindingDB:
Activity Spreadsheet -- Enzyme Inhibition Constant Data from BindingDB
Found 2 hits for monomerid = 32491
TargetMitogen-activated protein kinase 8(Homo sapiens (Human))
The Scripps Research Institute
LigandPNGBDBM32491(aryl piperidine, 9g)
Affinity DataIC50:  330nM. Assay description: Biochemical IC50s for JNK were determined using HTRF. In each assay the phosphor-Thr71-ATF-2 product was detected using a Europium-cryptate labeled a...
In DepthDetails ArticlePubMed
TargetIsoform Alpha-1 of Mitogen-activated protein kinase 10 (Alpha-1) 9-402](Homo sapiens (Human))
The Scripps Research Institute
LigandPNGBDBM32491(aryl piperidine, 9g)
Affinity DataIC50:  530nM. Assay description: Biochemical IC50s for JNK were determined using HTRF. In each assay the phosphor-Thr71-ATF-2 product was detected using a Europium-cryptate labeled a...
In DepthDetails ArticlePubMed