BDBM32555 arylsulfonylpiperazine, 27
SMILES Cc1ccc(cc1)S(=O)(=O)N1CCN(CC1)c1ncccc1C#N
InChI Key InChIKey=NYLACAAEFWBUQQ-UHFFFAOYSA-N
Data  1 IC50  1 EC50
  Tab Delimited (TSV)   2D SDfile   Computed 3D by Vconf -m prep SDfile
Find this compound or compounds like it in BindingDB:
Activity Spreadsheet -- Enzyme Inhibition Constant Data from BindingDB
Found 1 hit for monomerid = 32555
LigandPNGBDBM32555(arylsulfonylpiperazine, 27)
Affinity DataIC50:  628nM EC50: >1.00E+3nMpH: 7.2 T: 2°C. Assay description: Enzyme assays were performed using purified recombinant human 11beta-HSD1. The fractional conversion of cortisone to cortisol was used to determine e...
In DepthDetails ArticlePubMed