BDBM325564 6-Chloro-8-[5-(3-cyclobutyl-3-aza bicyclo[3.1.0]hex-6-yl)-[1,3,4]oxadiazol-2-yl]chroman-5-ylamine::US9636335, 6
SMILES Nc1c(Cl)cc(-c2nnc(o2)C2C3CN(CC23)C2CCC2)c2OCCCc12
InChI Key InChIKey=NODHOVISMISSPB-UHFFFAOYSA-N
Data  1 EC50
  Tab Delimited (TSV)   2D SDfile   Computed 3D by Vconf -m prep SDfile
Find this compound or compounds like it in BindingDB:
Activity Spreadsheet -- Enzyme Inhibition Constant Data from BindingDB
Found 1 hit for monomerid = 325564
Target5-hydroxytryptamine receptor 4(Homo sapiens (Human))
Suven Life Sciences
US Patent
LigandPNGBDBM325564(6-Chloro-8-[5-(3-cyclobutyl-3-aza bicyclo[3.1.0]he...)
Affinity DataEC50:  4.20nM. Assay description: A stable CHO cell line expressing recombinant human 5-HT4 receptor and pCRE-Luc reporter system was used for cell-based assay. The assay offers a non...
Ligand InfoPC cidPC sid
In DepthDetails US Patent