BDBM32565 arylsulfonylpiperazine, 37
SMILES COc1ccc(cc1)N1CCN(CC1)S(=O)(=O)c1ccc(cc1)C(C)(C)C
InChI Key InChIKey=JWYKKKRVYAJBJI-UHFFFAOYSA-N
Data  1 IC50  1 EC50
  Tab Delimited (TSV)   2D SDfile   Computed 3D by Vconf -m prep SDfile
Find this compound or compounds like it in BindingDB:
Activity Spreadsheet -- Enzyme Inhibition Constant Data from BindingDB
Found 1 hit for monomerid = 32565
LigandPNGBDBM32565(arylsulfonylpiperazine, 37)
Affinity DataIC50:  234nM EC50: >1.00E+3nM. Assay description: Enzyme assays were performed using purified recombinant human 11beta-HSD1. The fractional conversion of cortisone to cortisol was used to determine e...
In DepthDetails ArticlePubMed