BDBM32572 arylsulfonylpiperazine, 44
SMILES C[C@H]1CN(CCN1S(=O)(=O)c1ccc(cc1)C(C)(C)C)c1ncccc1C(F)(F)F
InChI Key InChIKey=JKFPLTSHRKSYDP-HNNXBMFYSA-N
Data  2 IC50  1 EC50
  Tab Delimited (TSV)   2D SDfile   Computed 3D by Vconf -m prep SDfile
Find this compound or compounds like it in BindingDB:
Activity Spreadsheet -- Enzyme Inhibition Constant Data from BindingDB
Found 2 hits for monomerid = 32572
Target11-beta-hydroxysteroid dehydrogenase 1(Mus musculus (mouse))
Amgen
LigandPNGBDBM32572(arylsulfonylpiperazine, 44)
Affinity DataIC50:  17nM. Assay description: Enzyme assays were performed using purified recombinant mouse11beta-HSD1. The fractional conversion of cortisone to cortisol was used to determine en...
In DepthDetails ArticlePubMed
LigandPNGBDBM32572(arylsulfonylpiperazine, 44)
Affinity DataIC50:  9nM EC50:  569nM. Assay description: Enzyme assays were performed using purified recombinant human 11beta-HSD1. The fractional conversion of cortisone to cortisol was used to determine e...
In DepthDetails ArticlePubMed