BDBM325730 (rac)-4-(3-Fluoro-4-(trifluoromethyl)phenyl)-5-phenyl-6,7-dihydro-5H-cyclopenta[c]pyridin-5-ol::US9636338, 4
SMILES OC1(CCc2cncc(c12)-c1ccc(c(F)c1)C(F)(F)F)c1ccccc1
InChI Key InChIKey=GTYKECURALXPMJ-UHFFFAOYSA-N
Data  2 EC50
  Tab Delimited (TSV)   2D SDfile   Computed 3D by Vconf -m prep SDfile
Find this compound or compounds like it in BindingDB:
Activity Spreadsheet -- Enzyme Inhibition Constant Data from BindingDB
Found 2 hits for monomerid = 325730
TargetCytochrome P450 11B2, mitochondrial(Homo sapiens (Human))
Hoffmann-La Roche
US Patent
LigandPNGBDBM325730((rac)-4-(3-Fluoro-4-(trifluoromethyl)phenyl)-5-phe...)
Affinity DataEC50:  50nM. Assay description: The expression plasmids contains the ORF for either human/cyno CYP11B1 or CYP11B2 under the control of a suitable promoter (CMV-promoter) and a suita...
Ligand InfoPC cidPC sid
In DepthDetails US Patent
TargetCytochrome P450 11B1, mitochondrial(Homo sapiens (Human))
Hoffmann-La Roche
US Patent
LigandPNGBDBM325730((rac)-4-(3-Fluoro-4-(trifluoromethyl)phenyl)-5-phe...)
Affinity DataEC50:  1.96E+3nM. Assay description: The expression plasmids contains the ORF for either human/cyno CYP11B1 or CYP11B2 under the control of a suitable promoter (CMV-promoter) and a suita...
Ligand InfoPC cidPC sid
In DepthDetails US Patent