BDBM325764 (rac)-N-Ethyl-2-[4-[2-fluoro-4-(trifluoromethyl)phenyl]-6,7-dihydro-5H-cyclopenta[c]pyridin-7-yl]-N-methyl-acetamide::US9636339, 14
SMILES CCN(C)C(=O)CC1CCc2c1cncc2-c1ccc(cc1F)C(F)(F)F
InChI Key InChIKey=PDJBESLSPDPQEE-UHFFFAOYSA-N
Data  2 EC50
  Tab Delimited (TSV)   2D SDfile   Computed 3D by Vconf -m prep SDfile
Find this compound or compounds like it in BindingDB:
Activity Spreadsheet -- Enzyme Inhibition Constant Data from BindingDB
Found 2 hits for monomerid = 325764
TargetCytochrome P450 11B2, mitochondrial(Homo sapiens (Human))
Hoffmann-La Roche
US Patent
LigandPNGBDBM325764((rac)-N-Ethyl-2-[4-[2-fluoro-4-(trifluoromethyl)ph...)
Affinity DataEC50:  44nM. Assay description: G-402 cells expressing CYP11 constructs were established as described above and maintained in McCoy's 5a Medium Modified, ATCC Catalog No. 30-200...
Ligand InfoPC cidPC sid
In DepthDetails US Patent
TargetCytochrome P450 11B1, mitochondrial(Homo sapiens (Human))
Hoffmann-La Roche
US Patent
LigandPNGBDBM325764((rac)-N-Ethyl-2-[4-[2-fluoro-4-(trifluoromethyl)ph...)
Affinity DataEC50:  2.12E+3nM. Assay description: G-402 cells expressing CYP11 constructs were established as described above and maintained in McCoy's 5a Medium Modified, ATCC Catalog No. 30-200...
Ligand InfoPC cidPC sid
In DepthDetails US Patent