BDBM32590 1-aza-2-oxobicyclo[5.3.0]decane scaffold, 20a
SMILES CC[C@H](N)C(=O)N[C@H]1[C@@H](CN(C)Cc2ccccc2)CC[C@H]2CC[C@H](N2C1=O)C(=O)NC(c1ccccc1)c1ccccc1
InChI Key InChIKey=BWLSZCKRHLWKLH-PIXGQMGXSA-N
Data  2 IC50
  Tab Delimited (TSV)   2D SDfile   Computed 3D by Vconf -m prep SDfile
Find this compound or compounds like it in BindingDB:
Activity Spreadsheet -- Enzyme Inhibition Constant Data from BindingDB
Found 2 hits for monomerid = 32590
TargetE3 ubiquitin-protein ligase XIAP(Homo sapiens (Human))
Universita Degli Studi Di Milano
LigandPNGBDBM32590(1-aza-2-oxobicyclo[5.3.0]decane scaffold, 20a)
Affinity DataIC50:  150nM. Assay description: Fluorescence polarization was measured on an Ultra plate reader (Tecan) at excitation and emission wavelengths of 485 and 530 nm, respectively. The e...
In DepthDetails ArticlePubMed
TargetBaculoviral IAP repeat-containing protein 3(Homo sapiens (Human))
Universita Degli Studi Di Milano
LigandPNGBDBM32590(1-aza-2-oxobicyclo[5.3.0]decane scaffold, 20a)
Affinity DataIC50:  650nMpH: 7.5 T: 2°C. Assay description: Fluorescence polarization was measured on an Ultra plate reader (Tecan) at excitation and emission wavelengths of 485 and 530 nm, respectively. The e...
In DepthDetails ArticlePubMed