BDBM32597 1-aza-2-oxobicyclo[5.3.0]decane scaffold, 24b
SMILES CC[C@H](N)C(=O)N[C@H]1[C@@H](CNS(=O)(=O)c2ccc(C)cc2)CC[C@H]2CC[C@H](N2C1=O)C(=O)NC(c1ccccc1)c1ccccc1
InChI Key InChIKey=VMODNEWYLILSMS-YSOADSQMSA-N
Data  2 IC50
  Tab Delimited (TSV)   2D SDfile   Computed 3D by Vconf -m prep SDfile
Find this compound or compounds like it in BindingDB:
Activity Spreadsheet -- Enzyme Inhibition Constant Data from BindingDB
Found 2 hits for monomerid = 32597
TargetE3 ubiquitin-protein ligase XIAP(Homo sapiens (Human))
Universita Degli Studi Di Milano
LigandPNGBDBM32597(1-aza-2-oxobicyclo[5.3.0]decane scaffold, 24b)
Affinity DataIC50:  160nM. Assay description: Fluorescence polarization was measured on an Ultra plate reader (Tecan) at excitation and emission wavelengths of 485 and 530 nm, respectively. The e...
In DepthDetails ArticlePubMed
TargetBaculoviral IAP repeat-containing protein 3(Homo sapiens (Human))
Universita Degli Studi Di Milano
LigandPNGBDBM32597(1-aza-2-oxobicyclo[5.3.0]decane scaffold, 24b)
Affinity DataIC50:  510nMpH: 7.5 T: 2°C. Assay description: Fluorescence polarization was measured on an Ultra plate reader (Tecan) at excitation and emission wavelengths of 485 and 530 nm, respectively. The e...
In DepthDetails ArticlePubMed