BDBM325971 7-[(2,5-dioxopyrrolidin-1-yl)methyl]-8-fluoro-4-(4-fluorophenyl)quinoline-2-carboxamide::US9636337, 7-13
SMILES NC(=O)c1cc(-c2ccc(F)cc2)c2ccc(CN3C(=O)CCC3=O)c(F)c2n1
InChI Key InChIKey=FEMOQAVTTOXVLN-UHFFFAOYSA-N
Data  2 IC50
  Tab Delimited (TSV)   2D SDfile   Computed 3D by Vconf -m prep SDfile
Find this compound or compounds like it in BindingDB:
Activity Spreadsheet -- Enzyme Inhibition Constant Data from BindingDB
Found 2 hits for monomerid = 325971
TargetMetabotropic glutamate receptor 2(Homo sapiens (Human))
Merck Sharp & Dohme
US Patent
LigandPNGBDBM325971(7-[(2,5-dioxopyrrolidin-1-yl)methyl]-8-fluoro-4-(4...)
Affinity DataIC50:  13nM. Assay description: The utility of the compounds in accordance with the present invention as antagonists of metabotropic glutamate receptor activity, in particular mGluR...
Ligand InfoPC cidPC sid
In DepthDetails US Patent
TargetMetabotropic glutamate receptor 2(Homo sapiens (Human))
Merck Sharp & Dohme
US Patent
LigandPNGBDBM325971(7-[(2,5-dioxopyrrolidin-1-yl)methyl]-8-fluoro-4-(4...)
Affinity DataIC50:  13nM. Assay description: The utility of the compounds in accordance with the present invention as antagonists of metabotropic glutamate receptor activity, in particular mGluR...
Ligand InfoPC cidPC sid
In DepthDetails US Patent