BDBM326000 1-({(3R)-3-[7-amino-1-(4- phenoxyphenyl)-1H- pyrazolo[3,4-c]pyridin-3- yl]piperidin-1- yl}carbonyl)cyclopropanol::US9637486, Example 5
SMILES Nc1nccc2c(nn(-c3ccc(Oc4ccccc4)cc3)c12)[C@@H]1CCCN(C1)C(=O)C1(O)CC1
InChI Key InChIKey=MVQJRDVKNABINH-GOSISDBHSA-N
Data  1 IC50
  Tab Delimited (TSV)   2D SDfile   Computed 3D by Vconf -m prep SDfile
Find this compound or compounds like it in BindingDB:
Activity Spreadsheet -- Enzyme Inhibition Constant Data from BindingDB
Found 1 hit for monomerid = 326000
TargetTyrosine-protein kinase BTK(Homo sapiens (Human))
Merck Sharp & Dohme
US Patent
LigandPNGBDBM326000(1-({(3R)-3-[7-amino-1-(4- phenoxyphenyl)-1H- pyraz...)
Affinity DataIC50:  3nM. Assay description: In this assay, the potency (IC50) of each compound was determined from an eleven point (1:3 serial dilution; final compound concentration range in as...
Ligand InfoPC cidPC sid
In DepthDetails US Patent