BDBM326096 US10273223, Compound C-29::US9637472, Compound C-29
SMILES CN(CCO)Cc1cccc(c1)-c1cc(C(=O)NCc2c(C)cc(C)[nH]c2=O)c2cnn(C3CCCC3)c2c1
InChI Key InChIKey=PTEOPURLDPKWKP-UHFFFAOYSA-N
Data  2 IC50
  Tab Delimited (TSV)   2D SDfile   Computed 3D by Vconf -m prep SDfile
Find this compound or compounds like it in BindingDB:
Activity Spreadsheet -- Enzyme Inhibition Constant Data from BindingDB
Found 2 hits for monomerid = 326096
TargetHistone-lysine N-methyltransferase EZH2(Homo sapiens (Human))
Epizyme
US Patent
LigandPNGBDBM326096(US10273223, Compound C-29 | US9637472, Compound C-...)
Affinity DataIC50: <300nM. Assay description: eneral Procedure for Wild-Type PRC2 Enzyme Assay on Oligonucleosome Substrate. The assays was performed in a buffer consisting of 20 mM bicine (pH=7....
Ligand InfoPC cidPC sid
In DepthDetails US Patent
TargetHistone-lysine N-methyltransferase EZH2(Homo sapiens (Human))
Epizyme
US Patent
LigandPNGBDBM326096(US10273223, Compound C-29 | US9637472, Compound C-...)
Affinity DataIC50: <300nM. Assay description: Recombinant PRC2 Enzymes. Human PRC2 enzymes were purified as 4-component enzyme complexes co-expressed in Spodoptera frugiperda (sf9) cells using a ...
Ligand InfoPC cidPC sid
In DepthDetails US Patent