BDBM326139 US10273223, Compound D-37::US9637472, Compound D-37
SMILES Cc1cc(C)c(CNC(=O)c2cc(cc3n(ncc23)C2CCCC2)C2=CCN(CC2)C(=O)C2CNC2)c(=O)[nH]1
InChI Key InChIKey=UNFWCLRMUIAKEA-UHFFFAOYSA-N
Data  2 IC50
  Tab Delimited (TSV)   2D SDfile   Computed 3D by Vconf -m prep SDfile
Find this compound or compounds like it in BindingDB:
Activity Spreadsheet -- Enzyme Inhibition Constant Data from BindingDB
Found 2 hits for monomerid = 326139
TargetHistone-lysine N-methyltransferase EZH2(Homo sapiens (Human))
Epizyme
US Patent
LigandPNGBDBM326139(US10273223, Compound D-37 | US9637472, Compound D-...)
Affinity DataIC50: <300nM. Assay description: eneral Procedure for Wild-Type PRC2 Enzyme Assay on Oligonucleosome Substrate. The assays was performed in a buffer consisting of 20 mM bicine (pH=7....
Ligand InfoPC cidPC sid
In DepthDetails US Patent
TargetHistone-lysine N-methyltransferase EZH2(Homo sapiens (Human))
Epizyme
US Patent
LigandPNGBDBM326139(US10273223, Compound D-37 | US9637472, Compound D-...)
Affinity DataIC50: <300nM. Assay description: Recombinant PRC2 Enzymes. Human PRC2 enzymes were purified as 4-component enzyme complexes co-expressed in Spodoptera frugiperda (sf9) cells using a ...
Ligand InfoPC cidPC sid
In DepthDetails US Patent