BDBM326207 3-{(3R)-1-[(1-methyl-1H- imidazol-5- yl)carbonyl]piperidin-3- yl}-1-(4-phenoxyphenyl)- 1H-pyrazolo[3,4- c]pyridin-7-amine::US9637486, Example 19
SMILES Cn1cncc1C(=O)N1CCC[C@H](C1)c1nn(-c2ccc(Oc3ccccc3)cc2)c2c(N)nccc12
InChI Key InChIKey=WLSRXKFUVPQBPW-LJQANCHMSA-N
Data  1 IC50
  Tab Delimited (TSV)   2D SDfile   Computed 3D by Vconf -m prep SDfile
Find this compound or compounds like it in BindingDB:
Activity Spreadsheet -- Enzyme Inhibition Constant Data from BindingDB
Found 1 hit for monomerid = 326207
TargetTyrosine-protein kinase BTK(Homo sapiens (Human))
Merck Sharp & Dohme
US Patent
LigandPNGBDBM326207(3-{(3R)-1-[(1-methyl-1H- imidazol-5- yl)carbonyl]p...)
Affinity DataIC50:  2.70nM. Assay description: In this assay, the potency (IC50) of each compound was determined from an eleven point (1:3 serial dilution; final compound concentration range in as...
Ligand InfoPC cidPC sid
In DepthDetails US Patent