BDBM326237 (E)-N-(3-(6-amino-7-(4-benzoylphenyl)-8-oxo-7H-purin-9(8H)-yl)phenyl)-4-(dimethylamino)-N-methylbut-2-enamide ::US9637487, Compound 26
SMILES CN(C)C\C=C\C(=O)N(C)c1cccc(c1)-n1c2ncnc(N)c2n(-c2ccc(cc2)C(=O)c2ccccc2)c1=O
InChI Key InChIKey=DWLHTOQBEGVOTL-MDWZMJQESA-N
Data  1 IC50
  Tab Delimited (TSV)   2D SDfile   Computed 3D by Vconf -m prep SDfile
Find this compound or compounds like it in BindingDB:
Activity Spreadsheet -- Enzyme Inhibition Constant Data from BindingDB
Found 1 hit for monomerid = 326237
TargetTyrosine-protein kinase BTK(Homo sapiens (Human))
Pharmacyclics
US Patent
LigandPNGBDBM326237((E)-N-(3-(6-amino-7-(4-benzoylphenyl)-8-oxo-7H-pur...)
Affinity DataIC50: <100nM. Assay description: Human Btk kinase (Genbank accession # NP_000052) was purified from insect cells as a full-length construct containing a N-terminal 6×-His tag. Btk ki...
Ligand InfoPC cidPC sid
In DepthDetails US Patent