BDBM32625 Botryllamide H, 8::Botryllamide J, 10
SMILES Oc1ccc(C=CNC(=O)C(=O)Cc2cccc(O)c2C#N)cc1
InChI Key InChIKey=IWSUCMBGFPTICR-UHFFFAOYSA-N
Data  1 IC50  1 Other
  Tab Delimited (TSV)   2D SDfile   Computed 3D by Vconf -m prep SDfile
Find this compound or compounds like it in BindingDB:
Activity Spreadsheet -- Enzyme Inhibition Constant Data from BindingDB
Found 2 hits for monomerid = 32625
LigandPNGBDBM32625(Botryllamide H, 8 | Botryllamide J, 10)
Affinity DataIC50:  2.69E+4nMpH: 7.4 T: 2°C. Assay description: IC50 and maximal activities for inhibition of PhA accumulation were determined from dose-response curves. The accumulation of PhA, a fluorescent ABCG...
In DepthDetails ArticlePubMed
LigandPNGBDBM32625(Botryllamide H, 8 | Botryllamide J, 10)
Affinity DatapH: 7.4 T: 2°C. Assay description: IC50 and maximal activities for inhibition of PhA accumulation were determined from dose-response curves. The accumulation of PhA, a fluorescent ABCG...
In DepthDetails ArticlePubMed