BDBM326257 US9637488, 16
SMILES Fc1ccc2cc(C3CCCN3c3ncnc4nc[nH]c34)c(nc2c1)-c1ccccn1
InChI Key
Data  1 IC50
  Tab Delimited (TSV)   2D SDfile   Computed 3D by Vconf -m prep SDfile
Find this compound or compounds like it in BindingDB:
Activity Spreadsheet -- Enzyme Inhibition Constant Data from BindingDB
Found 1 hit for monomerid = 326257
LigandPNGBDBM326257(US9637488, 16)
Affinity DataIC50:  2.20nM. Assay description: Exemplary compounds of the invention were tested their inhibitory activity or potency against PI3Kδ in 10-dose IC50 mode with 3-fold serial dilu...
Ligand InfoPC cidPC sid
In DepthDetails US Patent