BDBM326298 5-[2-amino-4- (trifluoromethyl) benzyl]-4-{[(1R)-1- cyclobutylethyl] amino}-6-(3- methylphenyl)-5H- pyrrolo[3,2- d]pyrimidine-2- carboxylic acid::US9637493, 2.1
SMILES C[C@@H](Nc1nc(nc2cc(-c3cccc(C)c3)n(Cc3ccc(cc3N)C(F)(F)F)c12)C(O)=O)C1CCC1
InChI Key InChIKey=VYAHCRMFIULLEO-MRXNPFEDSA-N
Data  1 IC50
  Tab Delimited (TSV)   2D SDfile   Computed 3D by Vconf -m prep SDfile
Find this compound or compounds like it in BindingDB:
Activity Spreadsheet -- Enzyme Inhibition Constant Data from BindingDB
Found 1 hit for monomerid = 326298
TargetE3 ubiquitin-protein ligase Mdm2 [17-125](Homo sapiens (Human))
Merck Sharp & Dohme
US Patent
LigandPNGBDBM326298(5-[2-amino-4- (trifluoromethyl) benzyl]-4-{[(1R)-1...)
Affinity DataIC50:  11nM. Assay description: Methods: An HDM2 FRET assay was developed to assess the compounds' inhibitory activity towards binding of p53 protein. A truncated version of HDM...
Ligand InfoPC cidPC sid
In DepthDetails US Patent