BDBM326384 (1R*,2S*)-2-(3-Aminopropyl)-1-[1-(5-methylpyridin-2-yl)-1H-imidazol-4-yl]cyclopropanecarboxylic acid::US9662310, Example 49
SMILES Cc1ccc(nc1)-n1cnc(c1)C1(CC1CCCN)C(O)=O
InChI Key InChIKey=ZPFMNMNWJGHXRK-UHFFFAOYSA-N
Data  1 IC50
  Tab Delimited (TSV)   2D SDfile   Computed 3D by Vconf -m prep SDfile
Find this compound or compounds like it in BindingDB:
Activity Spreadsheet -- Enzyme Inhibition Constant Data from BindingDB
Found 1 hit for monomerid = 326384
TargetCarboxypeptidase B2(Homo sapiens (Human))
Daiichi Sankyo
US Patent
LigandPNGBDBM326384((1R*,2S*)-2-(3-Aminopropyl)-1-[1-(5-methylpyridin-...)
Affinity DataIC50:  18nM. Assay description: HEPES buffered saline (20 mM HEPES, 150 mM NaCl, pH 7.4; hereinafter, referred to as HBS) was used in the preparation of a reaction solution. To 12 &...
Ligand InfoPC cidPC sid
In DepthDetails US Patent