BDBM326396 (1S,2R)-2-[(2R)-2-(Aminomethyl)butyl]-1-(1-pyridin-2-yl-1H-imidazol-4-yl)cyclopropanecarboxylic acid::US9662310, Example 61
SMILES CC[C@@H](CN)C[C@@H]1C[C@@]1(C(O)=O)c1cn(cn1)-c1ccccn1
InChI Key InChIKey=BEUXTDNZDSFKGE-XNJGSVPQSA-N
Data  1 IC50
  Tab Delimited (TSV)   2D SDfile   Computed 3D by Vconf -m prep SDfile
Find this compound or compounds like it in BindingDB:
Activity Spreadsheet -- Enzyme Inhibition Constant Data from BindingDB
Found 1 hit for monomerid = 326396
TargetCarboxypeptidase B2(Homo sapiens (Human))
Daiichi Sankyo
US Patent
LigandPNGBDBM326396((1S,2R)-2-[(2R)-2-(Aminomethyl)butyl]-1-(1-pyridin...)
Affinity DataIC50:  360nM. Assay description: HEPES buffered saline (20 mM HEPES, 150 mM NaCl, pH 7.4; hereinafter, referred to as HBS) was used in the preparation of a reaction solution. To 12 &...
Ligand InfoPC cidPC sid
In DepthDetails US Patent