BDBM326645 ((1S,2R,4R)-2-((5-bromopyrazin-2-yl)amino)-7-azabicyclo[2.2.1]heptan-7-yl)(3-methyl-2-(2H-1,2,3-triazol-2-yl)phenyl)methanone::US9637496, 312
SMILES Cc1cccc(C(=O)N2C3CCC2C(C3)Nc2cnc(Br)cn2)c1-n1nccn1
InChI Key InChIKey=RZJXARDAVVMHCL-UHFFFAOYSA-N
Data  3 KI
  Tab Delimited (TSV)   2D SDfile   Computed 3D by Vconf -m prep SDfile
Find this compound or compounds like it in BindingDB:
Activity Spreadsheet -- Enzyme Inhibition Constant Data from BindingDB
Found 3 hits for monomerid = 326645
TargetOrexin/Hypocretin receptor type 1(Rattus norvegicus (Rat))
Janssen Pharmaceutica
US Patent
LigandPNGBDBM326645(((1S,2R,4R)-2-((5-bromopyrazin-2-yl)amino)-7-azabi...)
Affinity DataKi:  6nM. Assay description: Human Embryonic Kidney 293 cells (HEK293) stably expressing rat orexin 1 receptor (Genebank accession number NM_001525) or Chinese ovary cells (CHO) ...
Ligand InfoPC cidPC sid
In DepthDetails US Patent
TargetOrexin/Hypocretin receptor type 1(Homo sapiens (Human))
Janssen Pharmaceutica
US Patent
LigandPNGBDBM326645(((1S,2R,4R)-2-((5-bromopyrazin-2-yl)amino)-7-azabi...)
Affinity DataKi:  9nM. Assay description: Human Embryonic Kidney 293 cells (HEK293) stably expressing rat orexin 1 receptor (Genebank accession number NM_001525) or Chinese ovary cells (CHO) ...
Ligand InfoPC cidPC sid
In DepthDetails US Patent
TargetOrexin receptor type 2(Homo sapiens (Human))
Janssen Pharmaceutica
US Patent
LigandPNGBDBM326645(((1S,2R,4R)-2-((5-bromopyrazin-2-yl)amino)-7-azabi...)
Affinity DataKi:  360nM. Assay description: HEK293 stably expressing human orexin 2 receptor (Genebank accession number NM_001526) were grown to confluency in DMEM (Hyclone, cat #SH30022), 10% ...
Ligand InfoPC cidPC sid
In DepthDetails US Patent