BDBM326827 US9662327, Compound 412::US9662327, Compound 450
SMILES COC(=O)CCC(=O)N1CCN(C[C@H]1C(C)C)c1nc(C2CC2)c2COC(C)(C)Cc2c1C#N
InChI Key InChIKey=JPRYCVUCBMCXFD-NRFANRHFSA-N
Data  2 IC50
  Tab Delimited (TSV)   2D SDfile   Computed 3D by Vconf -m prep SDfile
Find this compound or compounds like it in BindingDB:
Activity Spreadsheet -- Enzyme Inhibition Constant Data from BindingDB
Found 2 hits for monomerid = 326827
TargetIsocitrate dehydrogenase [NADP] cytoplasmic [R132H](Homo sapiens (Human))
Agios Pharmaceuticals
US Patent
LigandPNGBDBM326827(US9662327, Compound 412 | US9662327, Compound 450)
Affinity DataIC50: <500nM. Assay description: Assays were conducted in a volume of 76 μl assay buffer (150 mM NaCl, 10 mM MgCl2, 20 mM Tris pH 7.5, 0.03% bovine serum albumin) as follows in ...
Ligand InfoPC cidPC sid
In DepthDetails US Patent
TargetIsocitrate dehydrogenase [NADP] cytoplasmic [R132H](Homo sapiens (Human))
Agios Pharmaceuticals
US Patent
LigandPNGBDBM326827(US9662327, Compound 412 | US9662327, Compound 450)
Affinity DataIC50: <500nM. Assay description: Assays were conducted in a volume of 76 μl assay buffer (150 mM NaCl, 10 mM MgCl2, 20 mM Tris pH 7.5, 0.03% bovine serum albumin) as follows in ...
Ligand InfoPC cidPC sid
In DepthDetails US Patent