BDBM326895 US9662327, Compound 481
SMILES CS(=O)(=O)N1CCc2c(C1)c(nc(N1CCN([C@@H](C1)C1CC1)C(=O)C1CC1)c2C#N)C1CC1
InChI Key InChIKey=DTOGJBQBUKGRIZ-NRFANRHFSA-N
Data  1 IC50
  Tab Delimited (TSV)   2D SDfile   Computed 3D by Vconf -m prep SDfile
Find this compound or compounds like it in BindingDB:
Activity Spreadsheet -- Enzyme Inhibition Constant Data from BindingDB
Found 1 hit for monomerid = 326895
TargetIsocitrate dehydrogenase [NADP] cytoplasmic [R132H](Homo sapiens (Human))
Agios Pharmaceuticals
US Patent
LigandPNGBDBM326895(US9662327, Compound 481)
Affinity DataIC50: <500nM. Assay description: Assays were conducted in a volume of 76 μl assay buffer (150 mM NaCl, 10 mM MgCl2, 20 mM Tris pH 7.5, 0.03% bovine serum albumin) as follows in ...
Ligand InfoPC cidPC sid
In DepthDetails US Patent