BDBM32691 MLS000067834::N-(4-Ethyl-phenyl)-2-(3-trifluoromethyl-5,6-dihydro-4H-cyclopentapyrazol-1-yl)-acetamide::N-(4-ethylphenyl)-2-[3-(trifluoromethyl)-5,6-dihydro-4H-cyclopenta[c]pyrazol-1-yl]acetamide::N-(4-ethylphenyl)-2-[3-(trifluoromethyl)-5,6-dihydro-4H-cyclopenta[c]pyrazol-1-yl]ethanamide::SMR000122363::cid_798516
SMILES CCc1ccc(NC(=O)Cn2nc(c3CCCc23)C(F)(F)F)cc1
InChI Key InChIKey=WPFBKWSAENHZEW-UHFFFAOYSA-N
Data  2 IC50
  Tab Delimited (TSV)   2D SDfile   Computed 3D by Vconf -m prep SDfile
Find this compound or compounds like it in BindingDB:
Activity Spreadsheet -- Enzyme Inhibition Constant Data from BindingDB
Found 2 hits for monomerid = 32691
TargetCoagulation factor XI(Homo sapiens (Human))
Pcmd
Curated by PubChem BioAssay
LigandPNGBDBM32691(MLS000067834 | N-(4-Ethyl-phenyl)-2-(3-trifluorome...)
Affinity DataIC50: >5.00E+4nM. Assay description: Molecular Library Screening Center Network (MLSCN) Penn Center for Molecular Discovery (PCMD) Assay Provider: Scott L. Diamond, University of Pennsy...
In DepthDetails PCBioAssay
TargetCoagulation factor XI(Homo sapiens (Human))
Pcmd
Curated by PubChem BioAssay
LigandPNGBDBM32691(MLS000067834 | N-(4-Ethyl-phenyl)-2-(3-trifluorome...)
Affinity DataIC50: >5.00E+4nMpH: 7.4 T: 2°C. Assay description: Factor XIa (0.23 ug/mL) was incubated with Boc-Glu-Ala-Arg-AMC substrate (15 uM) in 10 uL of assay buffer for 2 hr at room temperature. Read fluoresc...
In DepthDetails PCBioAssay