BDBM32694 MLS000525859::N-[2-Oxo-1-(6-oxo-2-thioxo-3,6-dihydro-2H-pyrimidin-1-yl)-2-phenyl-ethyl]-benzamide::N-[2-keto-1-(4-keto-2-thioxo-1H-pyrimidin-3-yl)-2-phenyl-ethyl]benzamide::N-[2-oxidanylidene-1-(4-oxidanylidene-2-sulfanylidene-1H-pyrimidin-3-yl)-2-phenyl-ethyl]benzamide::N-[2-oxo-1-(4-oxo-2-sulfanylidene-1H-pyrimidin-3-yl)-2-phenylethyl]benzamide::SMR000116333::cid_2830411
SMILES O=C(NC(C(=O)c1ccccc1)n1c(=O)cc[nH]c1=S)c1ccccc1
InChI Key InChIKey=FXQHZKQXHQFHHE-UHFFFAOYSA-N
Data  2 IC50
  Tab Delimited (TSV)   2D SDfile   Computed 3D by Vconf -m prep SDfile
Find this compound or compounds like it in BindingDB:
Activity Spreadsheet -- Enzyme Inhibition Constant Data from BindingDB
Found 2 hits for monomerid = 32694
TargetCoagulation factor XI(Homo sapiens (Human))
Pcmd
Curated by PubChem BioAssay
LigandPNGBDBM32694(MLS000525859 | N-[2-Oxo-1-(6-oxo-2-thioxo-3,6-dihy...)
Affinity DataIC50: >5.00E+4nM. Assay description: Molecular Library Screening Center Network (MLSCN) Penn Center for Molecular Discovery (PCMD) Assay Provider: Scott L. Diamond, University of Pennsy...
In DepthDetails PCBioAssay
TargetCoagulation factor XI(Homo sapiens (Human))
Pcmd
Curated by PubChem BioAssay
LigandPNGBDBM32694(MLS000525859 | N-[2-Oxo-1-(6-oxo-2-thioxo-3,6-dihy...)
Affinity DataIC50: >5.00E+4nMpH: 7.4 T: 2°C. Assay description: Factor XIa (0.23 ug/mL) was incubated with Boc-Glu-Ala-Arg-AMC substrate (15 uM) in 10 uL of assay buffer for 2 hr at room temperature. Read fluoresc...
In DepthDetails PCBioAssay