BDBM327255 2-{[4-chloro-2-({[4-chloro-3-(trifluoromethyl)-phenyl]sulfonyl}amino)phenyl]sulfonyl}-N-methylacetamide::US9663460, Example 44
SMILES CNC(=O)CS(=O)(=O)c1ccc(Cl)cc1NS(=O)(=O)c1ccc(Cl)c(c1)C(F)(F)F
InChI Key InChIKey=MUWTYBRNFPGYFC-UHFFFAOYSA-N
Data  1 IC50
  Tab Delimited (TSV)   2D SDfile   Computed 3D by Vconf -m prep SDfile
Find this compound or compounds like it in BindingDB:
Activity Spreadsheet -- Enzyme Inhibition Constant Data from BindingDB
Found 1 hit for monomerid = 327255
TargetC-C chemokine receptor type 2(Homo sapiens (Human))
Allergan
US Patent
LigandPNGBDBM327255(2-{[4-chloro-2-({[4-chloro-3-(trifluoromethyl)-phe...)
Affinity DataIC50:  469nM. Assay description: HEK-Gqi5 cells stably expressing CCR2 were cultured in (DMEM high glucose, 10% FBS, 1% PSA, 400 μg/ml geneticin and 50 μg/ml hygromycin. Ap...
Ligand InfoPC cidPC sid
In DepthDetails US Patent