BDBM32733 MLS000554800::N-(2-Diethylamino-ethyl)-2-(3-methyl-4-oxo-3,4-dihydro-phthalazin-1-yl)-propionamide::N-[2-(diethylamino)ethyl]-2-(3-methyl-4-oxidanylidene-phthalazin-1-yl)propanamide::N-[2-(diethylamino)ethyl]-2-(3-methyl-4-oxo-1-phthalazinyl)propanamide::N-[2-(diethylamino)ethyl]-2-(3-methyl-4-oxophthalazin-1-yl)propanamide::N-[2-(diethylamino)ethyl]-2-(4-keto-3-methyl-phthalazin-1-yl)propionamide::SMR000146917::cid_3137359
SMILES CCN(CC)CCNC(=O)C(C)c1nn(C)c(=O)c2ccccc12
InChI Key InChIKey=PVOCIDFYAGNVGJ-UHFFFAOYSA-N
Data  2 IC50
  Tab Delimited (TSV)   2D SDfile   Computed 3D by Vconf -m prep SDfile
Find this compound or compounds like it in BindingDB:
Activity Spreadsheet -- Enzyme Inhibition Constant Data from BindingDB
Found 2 hits for monomerid = 32733
TargetCoagulation factor XI(Homo sapiens (Human))
Pcmd
Curated by PubChem BioAssay
LigandPNGBDBM32733(MLS000554800 | N-(2-Diethylamino-ethyl)-2-(3-methy...)
Affinity DataIC50: >5.00E+4nM. Assay description: Molecular Library Screening Center Network (MLSCN) Penn Center for Molecular Discovery (PCMD) Assay Provider: Scott L. Diamond, University of Pennsy...
In DepthDetails PCBioAssay
TargetCoagulation factor XI(Homo sapiens (Human))
Pcmd
Curated by PubChem BioAssay
LigandPNGBDBM32733(MLS000554800 | N-(2-Diethylamino-ethyl)-2-(3-methy...)
Affinity DataIC50: >5.00E+4nMpH: 7.4 T: 2°C. Assay description: Factor XIa (0.23 ug/mL) was incubated with Boc-Glu-Ala-Arg-AMC substrate (15 uM) in 10 uL of assay buffer for 2 hr at room temperature. Read fluoresc...
In DepthDetails PCBioAssay