BDBM327343 N-(2-{[(2-aminopyridin-4-yl)methyl]thio}-5-chlorophenyl)-1-benzofuran-2-sulfonamide::US9663460, Example 149
SMILES Nc1cc(CSc2ccc(Cl)cc2NS(=O)(=O)c2cc3ccccc3o2)ccn1
InChI Key InChIKey=OXEASHUBPODYLM-UHFFFAOYSA-N
Data  1 IC50
  Tab Delimited (TSV)   2D SDfile   Computed 3D by Vconf -m prep SDfile
Find this compound or compounds like it in BindingDB:
Activity Spreadsheet -- Enzyme Inhibition Constant Data from BindingDB
Found 1 hit for monomerid = 327343
TargetC-C chemokine receptor type 2(Homo sapiens (Human))
Allergan
US Patent
LigandPNGBDBM327343(N-(2-{[(2-aminopyridin-4-yl)methyl]thio}-5-chlorop...)
Affinity DataIC50:  80nM. Assay description: HEK-Gqi5 cells stably expressing CCR2 were cultured in (DMEM high glucose, 10% FBS, 1% PSA, 400 μg/ml geneticin and 50 μg/ml hygromycin. Ap...
Ligand InfoPC cidPC sid
In DepthDetails US Patent