BDBM327401 N-{2-[(2-aminobenzyl)sulfonyl]-5-chlorophenyl}-1-benzofuran-2-sulfonamide::US9663460, Example 208
SMILES Nc1ccccc1CS(=O)(=O)c1ccc(Cl)cc1NS(=O)(=O)c1cc2ccccc2o1
InChI Key InChIKey=HCVICUDZZRRGHW-UHFFFAOYSA-N
Data  1 IC50
  Tab Delimited (TSV)   2D SDfile   Computed 3D by Vconf -m prep SDfile
Find this compound or compounds like it in BindingDB:
Activity Spreadsheet -- Enzyme Inhibition Constant Data from BindingDB
Found 1 hit for monomerid = 327401
TargetC-C chemokine receptor type 2(Homo sapiens (Human))
Allergan
US Patent
LigandPNGBDBM327401(N-{2-[(2-aminobenzyl)sulfonyl]-5-chlorophenyl}-1-b...)
Affinity DataIC50:  129nM. Assay description: HEK-Gqi5 cells stably expressing CCR2 were cultured in (DMEM high glucose, 10% FBS, 1% PSA, 400 μg/ml geneticin and 50 μg/ml hygromycin. Ap...
Ligand InfoPC cidPC sid
In DepthDetails US Patent