BDBM327410 N-{5-chloro-2-[(pyrimidin-2-ylmethyl)sulfonyl]-phenyl}-1-benzofuran-2-sulfonamide::US9663460, Example 217
SMILES Clc1ccc(c(NS(=O)(=O)c2cc3ccccc3o2)c1)S(=O)(=O)Cc1ncccn1
InChI Key InChIKey=OAYBSOJOABZJQK-UHFFFAOYSA-N
Data  1 IC50
  Tab Delimited (TSV)   2D SDfile   Computed 3D by Vconf -m prep SDfile
Find this compound or compounds like it in BindingDB:
Activity Spreadsheet -- Enzyme Inhibition Constant Data from BindingDB
Found 1 hit for monomerid = 327410
TargetC-C chemokine receptor type 2(Homo sapiens (Human))
Allergan
US Patent
LigandPNGBDBM327410(N-{5-chloro-2-[(pyrimidin-2-ylmethyl)sulfonyl]-phe...)
Affinity DataIC50:  151nM. Assay description: HEK-Gqi5 cells stably expressing CCR2 were cultured in (DMEM high glucose, 10% FBS, 1% PSA, 400 μg/ml geneticin and 50 μg/ml hygromycin. Ap...
Ligand InfoPC cidPC sid
In DepthDetails US Patent