BDBM327621 US9663469, 163
SMILES OCC1CCN(CC1)C(=O)C[C@@H]1CCc2cc(ccc2N1S(=O)(=O)c1ccc(F)cc1)C(O)(C(F)(F)F)C(F)(F)F
InChI Key InChIKey=AOAGOGCFRLTFQE-FQEVSTJZSA-N
Data  1 IC50
  Tab Delimited (TSV)   2D SDfile   Computed 3D by Vconf -m prep SDfile
Find this compound or compounds like it in BindingDB:
Activity Spreadsheet -- Enzyme Inhibition Constant Data from BindingDB
Found 1 hit for monomerid = 327621
TargetNuclear receptor ROR-gamma [262-507](Homo sapiens (Human))
Bristol-Myers Squibb
US Patent
LigandPNGBDBM327621(US9663469, 163)
Affinity DataIC50:  12.4nM. Assay description: The binding of potential ligands to RORγ is measured by competition with [3H] 25-hydroxycholesterol using a scintillation proximity assay (SPA) ...
Ligand InfoPC cidPC sid
In DepthDetails US Patent