BDBM327734 US9663469, 281::US9663469, 282
SMILES CC1(C)[C@@H](O)[C@H](NC(=O)C[C@@H]2CCc3cc(ccc3N2S(=O)(=O)c2ccc(F)cc2)C(O)(C(F)(F)F)C(F)(F)F)c2cc(ccc12)[N+]([O-])=O
InChI Key InChIKey=WOKISMASGWLYKE-PIVNMMCNSA-N
Data  2 IC50
  Tab Delimited (TSV)   2D SDfile   Computed 3D by Vconf -m prep SDfile
Find this compound or compounds like it in BindingDB:
Activity Spreadsheet -- Enzyme Inhibition Constant Data from BindingDB
Found 2 hits for monomerid = 327734
TargetNuclear receptor ROR-gamma [262-507](Homo sapiens (Human))
Bristol-Myers Squibb
US Patent
LigandPNGBDBM327734(US9663469, 281 | US9663469, 282)
Affinity DataIC50:  17.4nM. Assay description: The binding of potential ligands to RORγ is measured by competition with [3H] 25-hydroxycholesterol using a scintillation proximity assay (SPA) ...
Ligand InfoPC cidPC sid
In DepthDetails US Patent
TargetNuclear receptor ROR-gamma [262-507](Homo sapiens (Human))
Bristol-Myers Squibb
US Patent
LigandPNGBDBM327734(US9663469, 281 | US9663469, 282)
Affinity DataIC50:  49.1nM. Assay description: The binding of potential ligands to RORγ is measured by competition with [3H] 25-hydroxycholesterol using a scintillation proximity assay (SPA) ...
Ligand InfoPC cidPC sid
In DepthDetails US Patent