BDBM327794 US9663475, Compound A12
SMILES COc1cccc2CC(Cc12)N1Cc2ccc(Cl)cc2N=C1N
InChI Key InChIKey=SLAOZQORDVKSLS-UHFFFAOYSA-N
Data  1 IC50
  Tab Delimited (TSV)   2D SDfile   Computed 3D by Vconf -m prep SDfile
Find this compound or compounds like it in BindingDB:
Activity Spreadsheet -- Enzyme Inhibition Constant Data from BindingDB
Found 1 hit for monomerid = 327794
TargetCathepsin D(Homo sapiens (Human))
Merck Patent
US Patent
LigandPNGBDBM327794(US9663475, Compound A12)
Affinity DataIC50:  810nM. Assay description: In order to identify modulators of cathepsin D activity, a continuous enzymatic test was carried out with a synthetic peptide which carries a fluores...
Ligand InfoPC cidPC sid
In DepthDetails US Patent