BDBM327810 US9663470, 32::cis-10-(6-Methyl-pyridazin-3-yloxy)-1,2,3,4,4a,5,6,10b-octahydro-benzo[f]quinoline
SMILES Cc1ccc(Oc2cccc3CC[C@H]4C(CCCN4C(=O)OC(C)(C)C)c23)nn1
InChI Key InChIKey=LBAQQTSCGXLKTE-ZVAWYAOSSA-N
Data  1 IC50
  Tab Delimited (TSV)   2D SDfile   Computed 3D by Vconf -m prep SDfile
Find this compound or compounds like it in BindingDB:
Activity Spreadsheet -- Enzyme Inhibition Constant Data from BindingDB
Found 1 hit for monomerid = 327810
Target11-beta-hydroxysteroid dehydrogenase 1(Homo sapiens (Human))
Vitae Pharmaceuticals
US Patent
LigandPNGBDBM327810(US9663470, 32 | cis-10-(6-Methyl-pyridazin-3-yloxy...)
Affinity DataIC50:  954nM. Assay description: In vitro inhibition of 11β-HSD1 by test compounds is determined with HTRF (Homogeneous Time-Resolved Fluorescence) technology (cisbio internatio...
Ligand InfoPC cidPC sid
In DepthDetails US Patent