BDBM327819 US9663475, Compound A27
SMILES Nc1nc2cc(ccc2c(=O)n1C1Cc2ccccc2C1)C(F)(F)F
InChI Key InChIKey=XLDZANMGOWHGIN-UHFFFAOYSA-N
Data  1 IC50
  Tab Delimited (TSV)   2D SDfile   Computed 3D by Vconf -m prep SDfile
Find this compound or compounds like it in BindingDB:
Activity Spreadsheet -- Enzyme Inhibition Constant Data from BindingDB
Found 1 hit for monomerid = 327819
TargetCathepsin D(Homo sapiens (Human))
Merck Patent
US Patent
LigandPNGBDBM327819(US9663475, Compound A27)
Affinity DataIC50:  3.30E+3nM. Assay description: In order to identify modulators of cathepsin D activity, a continuous enzymatic test was carried out with a synthetic peptide which carries a fluores...
Ligand InfoPC cidPC sid
In DepthDetails US Patent