BDBM327851 US9663479, Formula 2 peak 2 (chiral)
SMILES CCC1=CC2C(C[C@]2(CN)Cc2nn[nH]n2)C1
InChI Key
Data  1 IC50
  Tab Delimited (TSV)   2D SDfile   Computed 3D by Vconf -m prep SDfile
Find this compound or compounds like it in BindingDB:
Activity Spreadsheet -- Enzyme Inhibition Constant Data from BindingDB
Found 1 hit for monomerid = 327851
LigandPNGBDBM327851(US9663479, Formula 2 peak 2 (chiral))
Affinity DataIC50:  2.10nM. Assay description: This section describes a scintillation proximity assay (SPA) to measure [3H] gabapentin ([3H]GBP) binding to membranes containing α2δ-1 and...
Ligand InfoPC cidPC sid
In DepthDetails US Patent