BDBM32788 1-phenyl-5-(2-thenoyloxy)pyrazole-3-carboxylic acid ethyl ester::5-[oxo(thiophen-2-yl)methoxy]-1-phenyl-3-pyrazolecarboxylic acid ethyl ester::MLS000051814::SMR000080876::cid_1248113::ethyl 1-phenyl-5-(thiophene-2-carbonyloxy)pyrazole-3-carboxylate::ethyl 1-phenyl-5-[(2-thienylcarbonyl)oxy]-1H-pyrazole-3-carboxylate::ethyl 1-phenyl-5-thiophen-2-ylcarbonyloxy-pyrazole-3-carboxylate
SMILES CCOC(=O)c1cc(OC(=O)c2cccs2)n(n1)-c1ccccc1
InChI Key InChIKey=KUMFCNCSLBWZKE-UHFFFAOYSA-N
Data  1 IC50
  Tab Delimited (TSV)   2D SDfile   Computed 3D by Vconf -m prep SDfile
Find this compound or compounds like it in BindingDB:
Activity Spreadsheet -- Enzyme Inhibition Constant Data from BindingDB
Found 1 hit for monomerid = 32788
TargetCoagulation factor XI(Homo sapiens (Human))
Pcmd
Curated by PubChem BioAssay
LigandPNGBDBM32788(1-phenyl-5-(2-thenoyloxy)pyrazole-3-carboxylic aci...)
Affinity DataIC50:  1.09E+3nMpH: 7.4 T: 2°C. Assay description: Factor XIa (0.23 ug/mL) was incubated with Boc-Glu-Ala-Arg-AMC substrate (15 uM) in 10 uL of assay buffer for 2 hr at room temperature. Read fluoresc...
In DepthDetails PCBioAssay