BDBM327992 N-(1-(4- cyanobenzyl)piperidin-4- yl)-5-(4-(4- methoxybenzoyl) piperidine-1- carbonyl)picolinamide::US10377742, Compound 129::US9663496, Compound 129
SMILES COc1ccc(cc1)C(=O)C1CCN(CC1)C(=O)c1ccc(nc1)C(=O)NC1CCN(Cc2ccc(cc2)C#N)CC1
InChI Key InChIKey=POEZYVXOVVWICH-UHFFFAOYSA-N
Data  2 EC50
  Tab Delimited (TSV)   2D SDfile   Computed 3D by Vconf -m prep SDfile
Find this compound or compounds like it in BindingDB:
Activity Spreadsheet -- Enzyme Inhibition Constant Data from BindingDB
Found 2 hits for monomerid = 327992
Target5'-AMP-activated protein kinase catalytic subunit alpha-2(Homo sapiens (Human))
Rigel Pharmaceuticals
US Patent
LigandPNGBDBM327992(N-(1-(4- cyanobenzyl)piperidin-4- yl)-5-(4-(4- met...)
Affinity DataEC50: <500nM. Assay description: Compounds were assayed for their ability to activate AMPK using an enzyme-linked immunosorbent assay. Reagents and procedures for measuring AMPK acti...
Ligand InfoPC cidPC sid
In DepthDetails US Patent
Target5'-AMP-activated protein kinase catalytic subunit alpha-2(Homo sapiens (Human))
Rigel Pharmaceuticals
US Patent
LigandPNGBDBM327992(N-(1-(4- cyanobenzyl)piperidin-4- yl)-5-(4-(4- met...)
Affinity DataEC50: <500nM. Assay description: Compounds were assayed for their ability to activate AMPK using an enzyme-linked immunosorbent assay. Reagents and procedures for measuring AMPK acti...
Ligand InfoPC cidPC sid
In DepthDetails US Patent