BDBM328111 6-(4-(4- (cyclopropylsulfonyl) phenoxy)piperidine-1- carbonyl)-N-(1-(4- (trifluoromethoxy) benzyl)piperidin-4- yl)nicotinamide::US10377742, Compound 249::US9663496, Compound 249
SMILES FC(F)(F)Oc1ccc(CN2CCC(CC2)NC(=O)c2ccc(nc2)C(=O)N2CCC(CC2)Oc2ccc(cc2)S(=O)(=O)C2CC2)cc1
InChI Key InChIKey=LOCVLBUUUHGTAV-UHFFFAOYSA-N
Data  2 EC50
  Tab Delimited (TSV)   2D SDfile   Computed 3D by Vconf -m prep SDfile
Find this compound or compounds like it in BindingDB:
Activity Spreadsheet -- Enzyme Inhibition Constant Data from BindingDB
Found 2 hits for monomerid = 328111
Target5'-AMP-activated protein kinase catalytic subunit alpha-2(Homo sapiens (Human))
Rigel Pharmaceuticals
US Patent
LigandPNGBDBM328111(6-(4-(4- (cyclopropylsulfonyl) phenoxy)piperidine...)
Affinity DataEC50: <500nM. Assay description: Compounds were assayed for their ability to activate AMPK using an enzyme-linked immunosorbent assay. Reagents and procedures for measuring AMPK acti...
Ligand InfoPC cidPC sid
In DepthDetails US Patent
Target5'-AMP-activated protein kinase catalytic subunit alpha-2(Homo sapiens (Human))
Rigel Pharmaceuticals
US Patent
LigandPNGBDBM328111(6-(4-(4- (cyclopropylsulfonyl) phenoxy)piperidine...)
Affinity DataEC50: <500nM. Assay description: Compounds were assayed for their ability to activate AMPK using an enzyme-linked immunosorbent assay. Reagents and procedures for measuring AMPK acti...
Ligand InfoPC cidPC sid
In DepthDetails US Patent