BDBM328185 N-(1-(4- cyanobenzyl)piperidin-4- yl)-6-(4-(4- cyanophenoxy) piperidine-1- carbonyl)nicotinamide::US10377742, Compound 323::US9663496, Compound 323
SMILES O=C(NC1CCN(Cc2ccc(cc2)C#N)CC1)c1ccc(nc1)C(=O)N1CCC(CC1)Oc1ccc(cc1)C#N
InChI Key InChIKey=ZXOKHOODFVNZIC-UHFFFAOYSA-N
Data  2 EC50
  Tab Delimited (TSV)   2D SDfile   Computed 3D by Vconf -m prep SDfile
Find this compound or compounds like it in BindingDB:
Activity Spreadsheet -- Enzyme Inhibition Constant Data from BindingDB
Found 2 hits for monomerid = 328185
Target5'-AMP-activated protein kinase catalytic subunit alpha-2(Homo sapiens (Human))
Rigel Pharmaceuticals
US Patent
LigandPNGBDBM328185(N-(1-(4- cyanobenzyl)piperidin-4- yl)-6-(4-(4- cya...)
Affinity DataEC50: <500nM. Assay description: Compounds were assayed for their ability to activate AMPK using an enzyme-linked immunosorbent assay. Reagents and procedures for measuring AMPK acti...
Ligand InfoPC cidPC sid
In DepthDetails US Patent
Target5'-AMP-activated protein kinase catalytic subunit alpha-2(Homo sapiens (Human))
Rigel Pharmaceuticals
US Patent
LigandPNGBDBM328185(N-(1-(4- cyanobenzyl)piperidin-4- yl)-6-(4-(4- cya...)
Affinity DataEC50: <500nM. Assay description: Compounds were assayed for their ability to activate AMPK using an enzyme-linked immunosorbent assay. Reagents and procedures for measuring AMPK acti...
Ligand InfoPC cidPC sid
In DepthDetails US Patent