BDBM328276 6-(4-(3- acetamidophenoxy) piperidine-1-carbonyl)- N-(6-(4- fluorophenoxy)pyridin- 3-yl)nicotinamide::US10377742, Compound 414::US9663496, Compound 414
SMILES CC(=O)Nc1cccc(OC2CCN(CC2)C(=O)c2ccc(cn2)C(=O)Nc2ccc(Oc3ccc(F)cc3)nc2)c1
InChI Key InChIKey=HFTJORLORZXKEZ-UHFFFAOYSA-N
Data  2 EC50
  Tab Delimited (TSV)   2D SDfile   Computed 3D by Vconf -m prep SDfile
Find this compound or compounds like it in BindingDB:
Activity Spreadsheet -- Enzyme Inhibition Constant Data from BindingDB
Found 2 hits for monomerid = 328276
Target5'-AMP-activated protein kinase catalytic subunit alpha-2(Homo sapiens (Human))
Rigel Pharmaceuticals
US Patent
LigandPNGBDBM328276(6-(4-(3- acetamidophenoxy) piperidine-1-carbonyl)...)
Affinity DataEC50:  3.00E+3nM. Assay description: Compounds were assayed for their ability to activate AMPK using an enzyme-linked immunosorbent assay. Reagents and procedures for measuring AMPK acti...
Ligand InfoPC cidPC sid
In DepthDetails US Patent
Target5'-AMP-activated protein kinase catalytic subunit alpha-2(Homo sapiens (Human))
Rigel Pharmaceuticals
US Patent
LigandPNGBDBM328276(6-(4-(3- acetamidophenoxy) piperidine-1-carbonyl)...)
Affinity DataEC50:  3.00E+3nM. Assay description: Compounds were assayed for their ability to activate AMPK using an enzyme-linked immunosorbent assay. Reagents and procedures for measuring AMPK acti...
Ligand InfoPC cidPC sid
In DepthDetails US Patent