BDBM328301 N-(1-(4-methoxybenzyl) piperidin-4-yl)-6-(4-(4- (pyrrolidin-1- yl)benzoyl)piperidine-1- carbonyl)nicotinamide::US10377742, Compound 439::US9663496, Compound 439
SMILES COc1ccc(CN2CCC(CC2)NC(=O)c2ccc(nc2)C(=O)N2CCC(CC2)C(=O)c2ccc(cc2)N2CCCC2)cc1
InChI Key InChIKey=LLRSNVNZYTWKPN-UHFFFAOYSA-N
Data  2 EC50
  Tab Delimited (TSV)   2D SDfile   Computed 3D by Vconf -m prep SDfile
Find this compound or compounds like it in BindingDB:
Activity Spreadsheet -- Enzyme Inhibition Constant Data from BindingDB
Found 2 hits for monomerid = 328301
Target5'-AMP-activated protein kinase catalytic subunit alpha-2(Homo sapiens (Human))
Rigel Pharmaceuticals
US Patent
LigandPNGBDBM328301(N-(1-(4-methoxybenzyl) piperidin-4-yl)-6-(4-(4- (...)
Affinity DataEC50: <500nM. Assay description: Compounds were assayed for their ability to activate AMPK using an enzyme-linked immunosorbent assay. Reagents and procedures for measuring AMPK acti...
Ligand InfoPC cidPC sid
In DepthDetails US Patent
Target5'-AMP-activated protein kinase catalytic subunit alpha-2(Homo sapiens (Human))
Rigel Pharmaceuticals
US Patent
LigandPNGBDBM328301(N-(1-(4-methoxybenzyl) piperidin-4-yl)-6-(4-(4- (...)
Affinity DataEC50: <500nM. Assay description: Compounds were assayed for their ability to activate AMPK using an enzyme-linked immunosorbent assay. Reagents and procedures for measuring AMPK acti...
Ligand InfoPC cidPC sid
In DepthDetails US Patent