BDBM329094 5-chloro-4-(5-chloro-6-(2- chloro-5-fluorophenoxy)-3- pyridinyl)-2-fluoro-N- (methylsulfonyl)benzamide::5-chloro-4-(5-chloro-6-(2-chloro-5-fluorophenoxy)-3-pyridinyl)-2-fluoro-N-(methylsulfonyl)benzamide::US9663508, Example 595
SMILES CS(=O)(=O)NC(=O)c1cc(Cl)c(cc1F)-c1cnc(Oc2cc(F)ccc2Cl)c(Cl)c1
InChI Key InChIKey=JXGRQUMXBPWCDT-UHFFFAOYSA-N
Data  2 IC50
  Tab Delimited (TSV)   2D SDfile   Computed 3D by Vconf -m prep SDfile
Find this compound or compounds like it in BindingDB:
Activity Spreadsheet -- Enzyme Inhibition Constant Data from BindingDB
Found 2 hits for monomerid = 329094
TargetSodium channel protein type 5 subunit alpha(Homo sapiens (Human))
Amgen
US Patent
LigandPNGBDBM329094(5-chloro-4-(5-chloro-6-(2- chloro-5-fluorophenoxy)...)
Affinity DataIC50: >3.00E+3nM. Assay description: 293 cells stably transfected with human Nav 1.5 were recorded in whole cell voltage clamp mode with the PatchXpress automated electrophysiology syste...
Ligand InfoPC cidPC sid
In DepthDetails US Patent
TargetSodium channel protein type 9 subunit alpha(Homo sapiens (Human))
Amgen
US Patent
LigandPNGBDBM329094(5-chloro-4-(5-chloro-6-(2- chloro-5-fluorophenoxy)...)
Affinity DataIC50:  81.4nM. Assay description: HEK 293 cells stably transfected with human Nav1.7 were recorded in whole cell voltage clamp mode with the PatchXpress automated electrophysiology sy...
Ligand InfoPC cidPC sid
In DepthDetails US Patent