BDBM329384 US9663511, Compound 41.
SMILES CC(C)c1cc(nc2n(C)nc(C)c12)N(CCO)NC(=O)Nc1ccc(Cl)nc1Cl
InChI Key InChIKey=NFYHHNYSEPCHNG-UHFFFAOYSA-N
Data  2 IC50
  Tab Delimited (TSV)   2D SDfile   Computed 3D by Vconf -m prep SDfile
Find this compound or compounds like it in BindingDB:
Activity Spreadsheet -- Enzyme Inhibition Constant Data from BindingDB
Found 2 hits for monomerid = 329384
TargetSphingosine 1-phosphate receptor 5(Homo sapiens (Human))
Arroyo Biosciences
US Patent
LigandPNGBDBM329384(US9663511, Compound 41.)
Affinity DataIC50: >1.00E+4nM. Assay description: I. Master Stock SolutionUnless specified otherwise, the sample compounds were diluted in 100% anhydrous DMSO including all dilutions. The compounds w...
Ligand InfoPC cidPC sid
In DepthDetails US Patent
TargetSphingosine 1-phosphate receptor 2(Homo sapiens (Human))
Arroyo Biosciences
US Patent
LigandPNGBDBM329384(US9663511, Compound 41.)
Affinity DataIC50: >1.00E+4nM. Assay description: I. Master Stock SolutionUnless specified otherwise, the sample compounds were diluted in 100% anhydrous DMSO including all dilutions. The compounds w...
Ligand InfoPC cidPC sid
In DepthDetails US Patent