BDBM329493 N-(2-hydroxyethyl)-5-(4- (((1S,2S)-2-(5- methoxypyridin-2- yl)cyclopropyl)methoxy)- 2-methylpyrimidin-5- yl)picolinamide::US9663513, 106
SMILES COc1ccc(nc1)[C@H]1C[C@@H]1COc1nc(C)ncc1-c1ccc(nc1)C(=O)NCCO
InChI Key InChIKey=KHLOSLMIOFHDQM-AEFFLSMTSA-N
Data  1 KI
  Tab Delimited (TSV)   2D SDfile   Computed 3D by Vconf -m prep SDfile
Find this compound or compounds like it in BindingDB:
Activity Spreadsheet -- Enzyme Inhibition Constant Data from BindingDB
Found 1 hit for monomerid = 329493
TargetcAMP and cAMP-inhibited cGMP 3',5'-cyclic phosphodiesterase 10A(Homo sapiens (Human))
Merck Sharp & Dohme
US Patent
LigandPNGBDBM329493(N-(2-hydroxyethyl)-5-(4- (((1S,2S)-2-(5- methoxypy...)
Affinity DataKi:  0.640nM. Assay description: The fluorescence polarization assay for cyclic nucleotide phosphodiesterases was performed using an IMAP® FP kit supplied by Molecular Devices, Sunny...
Ligand InfoKEGGPC cidPC sid
In DepthDetails US Patent