BDBM329529 5-(2-methyl-4-(((1S,2S)- 2-(5-methylpyridin-2- yl)cyclopropyl)methoxy) pyrimidin-5-yl)-1H- pyrazolo[3,4-b]pyridine::US9663513, 142
SMILES Cc1ccc(nc1)[C@H]1C[C@@H]1COc1nc(C)ncc1-c1cnc2[nH]ncc2c1
InChI Key
Data  1 KI
  Tab Delimited (TSV)   2D SDfile   Computed 3D by Vconf -m prep SDfile
Find this compound or compounds like it in BindingDB:
Activity Spreadsheet -- Enzyme Inhibition Constant Data from BindingDB
Found 1 hit for monomerid = 329529
TargetcAMP and cAMP-inhibited cGMP 3',5'-cyclic phosphodiesterase 10A(Homo sapiens (Human))
Merck Sharp & Dohme
US Patent
LigandPNGBDBM329529(5-(2-methyl-4-(((1S,2S)- 2-(5-methylpyridin-2- yl)...)
Affinity DataKi:  0.370nM. Assay description: The fluorescence polarization assay for cyclic nucleotide phosphodiesterases was performed using an IMAP® FP kit supplied by Molecular Devices, Sunny...
Ligand InfoPC cidPC sid
In DepthDetails US Patent