BDBM329692 US9663519, Compound I-32
SMILES Cn1cncc1-c1ccncc1NC(=O)c1c(N)nn2cc3CN(CCc3nc12)C1COC1
InChI Key InChIKey=OJYMHYOYOBSXQY-UHFFFAOYSA-N
Data  1 KI
  Tab Delimited (TSV)   2D SDfile   Computed 3D by Vconf -m prep SDfile
Find this compound or compounds like it in BindingDB:
Activity Spreadsheet -- Enzyme Inhibition Constant Data from BindingDB
Found 1 hit for monomerid = 329692
TargetSerine/threonine-protein kinase ATR(Homo sapiens (Human))
Vertex Pharmaceuticals
US Patent
LigandPNGBDBM329692(US9663519, Compound I-32)
Affinity DataKi:  505nM. Assay description: Compounds were screened for their ability to inhibit ATR kinase using a radioactive-phosphate incorporation assay. Assays were carried out in a mixtu...
Ligand InfoPC cidPC sid
In DepthDetails US Patent